!!! WARNING The following tests failed:
*** [err]: PEXPIRE/PSETEX/PEXPIREAT can set sub-second expires in tests/unit/expire.tcl
Expected 'somevalue {}' to equal or match '{} {}'
Cleanup: may take some time... OK
Makefile:225: recipe for target 'test' failed
make[1]: *** [test] Error 1
make[1]: Leaving directory '/tmp/redis-stable/src'
Makefile:6: recipe for target 'test' failed
make: *** [test] Error 2